{"text_format":"1","workbook":"xlsx","n_sheets":5,"sheets":["Banco","Hoja3","Listas","Matriz Riesgos","Mapa de Calor"],"not_rendered":{"charts":1,"images":1,"macros":1,"external_links":1,"defined_names":12,"comments":2,"pivot_tables":0},"unopened":[],"bounds":{"document_bytes":16777216,"sheet_cells":100000,"rows_first":2000,"rows_last":500,"rows_between":2000,"halvings":0,"cell_chars":16384,"cell_head_chars":4096},"cells_cut":0,"cells_raw":0,"read":"whole","date_system":"1900"}

{"sheet":"Banco","index":0,"n_rows":119,"n_cols":13,"rows_kept":119,"cut":false,"hidden":true,"merged":[]}
["Nro","Tipo de Contrato","Etapa","Tipo de Riesgo","Descripción (Posibilidad+ Acción + Sujeto/Objeto + Complemento)","Causas (Qué o quien lo puede generar y por qué se puede presentar)","Consecuencias","Etapa","Tipo de Riesgo",null,"Tipo de Contrato","Etapa","Tipo de Riesgo"]
[5,"Compraventa","Contractual","Operacionales","Posibilidad de no suscribir el contrato o demás documentos contractuales, una vez haya sido adjudicado","Inconformidad del contratista con las cláusulas del contrato establecidos por la Universidad\nCambios en las condiciones económicas o técnicas del contratista\nExpedición de nuevas normas o cambios normativos que afecten la contratación\nFallecimiento del oferente cuando es persona natural","Reprocesos\nSuspensión o afectación de actividades y/o servicios\nInsatisfacción del usuario\nDemandas\nPérdidas económicas","Contractual","Operacionales",null,"Compraventa","Contractual","Operacionales"]
[6,"Compraventa","Contractual","Operacionales","Posibilidad de recibir o aceptar productos   defectuosos o servicios de baja calidad que no cumplan con las especificaciones contratadas\n","Falta de verificación del funcionamiento del producto recibido\nExistencia de acuerdos por fuera del contrato entre el servidor y el contratista\nDesconocimiento del servidor que recibe el producto de las características técnicas del mismo.\nCambio realizados por el proveedor en las características del producto contratado\nFalta de procedimientos establecidos para la recepción de productos\nFalta de aplicación del procedimiento para la verificación de los productos recibidos\n\n","Disminución de la calidad del servicio\nSuspensión o afectación de actividades y/o servicios\nReprocesos\nInsatisfacción del usuario\nProcesos disciplinarios, penales, fiscales administrativos sancionatorios\nDemandas\nDetrimento patrimonial\n","Contractual","Operacionales",null,"Hospedaje","Precontractual","Financieros (Crédito, Liquidez y Mercado)"]
[7,"Compraventa","Contractual","Operacionales","Posibilidad de incumplimiento de las obligaciones contractuales por alguna de las partes","No pago oportuno de las facturas presentadas por el contratista\nIncumplimiento en los tiempos, forma y lugar de entrega pactados\nCambios de las especificaciones técnicas sin previo acuerdo con el competente del contrato\nFallas en la logística del contratista para la entrega del producto o prestación del servicio\nFalta de insumos requeridos para producción de los bienes y la prestación de los servicios.\nDemoras en los trámites de importación del producto\nInexistencia de inventario del producto en el momento en que es requerido \nProblemas a nivel social que impidan el tránsito libre de la mercancía o del personal que presta el servicio. \nSuspensión o cancelación de las autorizaciones expedidas por las autoridades competentes. \nCambios en la normativa de importación o exportación del producto o insumo requerido.\nPresencia de epidemias, pandemias o sindemas en el entorno \nUso indebido del anticipo \nIncumplimiento de los acuerdos de confidencialidad definidos en el contrato o con ocasión del contrato\n\n\n\n\n\n\n\n","Suspensión o afectación de actividades y/o servicios\nInsatisfacción del usuario\nPérdidas económicas\nReprocesos\nProcesos disciplinarios, penales, fiscales o administrativos sancionatorios\nDemandas\nDetrimento Patrimonial\nDisminución de la calidad del servicio\n","Contractual","Operacionales",null,"Mandato",null,"Corrupción"]
[8,"Compraventa","Contractual","Operacionales","Posibilidad de no usar el producto adquirido o el servicio contratado","Falta de planeación por parte de los servidores encargados del proceso\nFalta de verificación de todas las condiciones para el funcionamiento del producto\nFalta de coordinación con las áreas responsables de las intervenciones locativas\nExpedición de nuevas normas o cambios normativos que afecten o prohíban el uso del producto o del servicio adquirido\nRetrasos en las intervenciones locativas requeridas\nInadecuada proyección de la destinación del producto\nFalta o deficiencias en la documentación técnica de usuario \nFalta de acceso a las actualizaciones del sistema\nPresencia de epidemias, pandemias o sindemas en el entorno\n","Suspensión o afectación de actividades y/o servicios\nReprocesos\nInsatisfacción del usuario\nProcesos disciplinarios, penales, fiscales o administrativos sancionatorios\nPérdidas económicas\nDetrimento patrimonial","Contractual","Operacionales",null,"Obra",null,"Seguridad y Salud en el Trabajo"]
[9,"Compraventa","Contractual","Financieros (Crédito, Liquidez y Mercado)","Posibilidad de variación en el valor del contrato con respecto al presupuesto aprobado","Fluctuación de las tasas de interés, tasas de cambio, variación cambiaria y financiera.\nVariación de la demanda del producto en el mercado\nFijación de nuevos impuestos, tasas, tributos aranceles o contribuciones durante la contratación\nAlteración en las condiciones políticas, sociales y económicas\nPresencia de epidemias, pandemias o sindemas en el entorno\nSituaciones o conflictos geopolíticos que impacten el mercado ","Suspensión o afectación de actividades y/o servicios\nDesequilibrio económico del contrato\nPérdidas económicas","Contractual","Financieros (Crédito, Liquidez y Mercado)",null,"Prestación_de_Servicios",null,"Operativos"]
[10,"Compraventa","Contractual","Corrupción","Posibilidad de que se presenten conductas o comportamientos de corrupción en alguna de las etapas del proceso de contratación establecido por la Universidad (precontractual, contractual y poscontractual), buscando un beneficio privado. ","Desacato/transgresión a los principios y valores establecidos en las normas universitarias por parte de los funcionarios responsables del proceso.\nOfrecimiento de dinero, prebendas o dádivas (soborno)\nRecibir o exigir dinero, prebendas o dádivas\nAbuso de poder o autoridad en la solicitud del proceso a personal responsable de tramitar la contratación.\nFalta de segregación de funciones en las diferentes etapas del proceso contractual \nFalta de rigurosidad en la aplicación de los procesos contractuales institucionales\nFalta de formación o actualización de los responsables de la contratación en la normatividad legal y reglamentaria que rige a la contratación de la Universidad.\nDebilidad o negligencia en el seguimiento y control del proceso de contratación\nDesignación de un funcionario que no cuenta con los conocimientos y/o experiencia requeridos para realizar el proceso de contratación\nOmisión o uso incorrecto y desarticulación de los sistemas de información que apoyan los trámites de contratación.\nEvitar las instancias de aprobación definidas en el Estatuto General de Contratación.","Pérdida de credibilidad en los procesos\nProcesos disciplinarios, penales, fiscales o administrativos sancionatorios\nDemandas\nPérdidas económicas\nDetrimento patrimonial\nPérdida de reputación","Contractual","Corrupción",null,"Prestación_de_Servicios_Salud"]
[12,"Compraventa","Contractual","Operacionales","Posibilidad de realizar una inadecuada interventoría del contrato","Falta de conocimiento por parte del interventor de la normativa y de los procedimientos aplicables.\nFalta de experiencia por parte del interventor en las actividades a su cargo.\nDebilidad en el proceso de selección del interventor.\nFalta o deficiencia de mecanismos que faciliten el seguimiento o interventoría del contrato.\nAusencia de capacitación al personal para asumir actividades de interventoría\nAlto manejo de la información en forma manual\nFalta de implementación de herramientas ofimáticas o tecnológicas.\nExcesiva carga laboral de los interventores.\n\n\n","Reprocesos\nSuspensión o afectación de actividades y/o servicios\nPérdidas económicas\nDetrimento patrimonial\nDemandas\nProcesos disciplinarios, penales, fiscales o administrativos sancionatorios\nPérdida de reputación\n","Contractual","Operacionales",null,"Seguros"]
[1,"Compraventa","Precontractual","Operacionales","Posibilidad de proyectar inadecuadamente los estudios previos para la adquisición del producto o servicio (características técnicas, presupuesto, proveedores, forma de contratación)","Falta de conocimiento por parte del servidor de las características del producto o servicio requerido\nFalta de conocimiento por parte del servidor de la normativa Universitaria o normas externas\nInexistencia o debilidad en la segregación de funciones durante el proceso de contratación\nFalta de planeación del proceso de contratación\nInadecuada realización del estudio de mercado\nAlto manejo de la información en forma manual\nDebilidad en el manejo de las herramientas ofimáticas o dispuestas por la Universidad.\nFalta de conocimiento o concentración por parte del servidor de los aspectos técnicos del estudio previo\n\n","Disminución de la calidad del servicio\nReprocesos\nDetrimento patrimonial\nInsatisfacción del usuario\nProcesos disciplinarios, penales, fiscales o administrativos sancionatorios\nSuspensión o afectación de actividades y/o servicios\n","Precontractual","Operacionales",null,"Sumunistro_AMP"]
[2,"Compraventa","Precontractual","Operacionales","Posibilidad de cometer errores en los términos de referencia o invitación a cotizar","Falta de conocimiento por parte del servidor de la normativa Universitaria o normas externas\nInexistencia o debilidad en la segregación de funciones durante el proceso de contratación\nAlto manejo de la información en forma manual\nDebilidad en el manejo de las herramientas ofimáticas o dispuestas por la Universidad.\nFalta de conocimiento o concentración por parte del servidor de los aspectos técnicos de los términos de referencia o invitación a cotizar. ","Reprocesos\nPérdida de reputación\nDemandas\nSuspensión o afectación de actividades y/o servicios\nInsatisfacción del usuario\nDetrimento patrimonial\nProcesos disciplinarios, penales, fiscales o administrativos sancionatorios","Precontractual","Operacionales",null,"Transporte"]
{"$rows_left_out":110}
{"sheet":"Hoja3","index":1,"n_rows":119,"n_cols":1,"rows_kept":119,"cut":false,"hidden":true,"merged":[]}
["Causas (Qué o quien lo puede generar y por qué se puede presentar)"]
["* Inconformidad del contratista con las cláusulas del contrato establecidos por la Universidad\n* Cambios en las condiciones económicas o técnicas del contratista\n* Expedición de nuevas normas o cambios normativos que afecten la contratación\n* Fallecimiento del oferente cuando es persona natural"]
["Falta de verificación del funcionamiento del producto recibido\nExistencia de acuerdos por fuera del contrato entre el servidor y el contratista\nDesconocimiento del servidor que recibe el producto de las características técnicas del mismo.\nCambio realizados por el proveedor en las características del producto contratado\nFalta de procedimientos establecidos para la recepción de productos\nFalta de aplicación del procedimiento para la verificación de los productos recibidos\n\n"]
["No pago oportuno de las facturas presentadas por el contratista\nIncumplimiento en los tiempos, forma y lugar de entrega pactados\nCambios de las especificaciones técnicas sin previo acuerdo con el competente del contrato\nFallas en la logística del contratista para la entrega del producto o prestación del servicio\nFalta de insumos requeridos para producción de los bienes y la prestación de los servicios.\nDemoras en los trámites de importación del producto\nInexistencia de inventario del producto en el momento en que es requerido \nProblemas a nivel social que impidan el tránsito libre de la mercancía o del personal que presta el servicio. \nSuspensión o cancelación de las autorizaciones expedidas por las autoridades competentes. \nCambios en la normativa de importación o exportación del producto o insumo requerido.\nPresencia de epidemias, pandemias o sindemias en el entorno \nUso indebido del anticipo \nIncumplimiento de los acuerdos de confidencialidad definidos en el contrato o con ocasión del contrato\n\n\n\n\n\n\n\n"]
["Falta de planeación por parte de los servidores encargados del proceso\nFalta de verificación de todas las condiciones para el funcionamiento del producto\nFalta de coordinación con las áreas responsables de las intervenciones locativas\nExpedición de nuevas normas o cambios normativos que afecten o prohíban el uso del producto o del servicio adquirido\nRetrasos en las intervenciones locativas requeridas\nInadecuada proyección de la destinación del producto\nFalta o deficiencias en la documentación técnica de usuario \nFalta de acceso a las actualizaciones del sistema\nPresencia de epidemias, pandemias o sindemias en el entorno\n"]
["Fluctuación de las tasas de interés, tasas de cambio, variación cambiaria y financiera.\nVariación de la demanda del producto en el mercado\nFijación de nuevos impuestos, tasas, tributos aranceles o contribuciones durante la contratación\nAlteración en las condiciones políticas, sociales y económicas\nPresencia de epidemias, pandemias o sindemias en el entorno\nSituaciones o conflictos geopolíticos que impacten el mercado "]
["Desacato/transgresión a los principios y valores establecidos en las normas universitarias por parte de los funcionarios responsables del proceso.\nOfrecimiento de dinero, prebendas o dádivas (soborno)\nRecibir o exigir dinero, prebendas o dádivas\nAbuso de poder o autoridad en la solicitud del proceso a personal responsable de tramitar la contratación.\nFalta de segregación de funciones en las diferentes etapas del proceso contractual \nFalta de rigurosidad en la aplicación de los procesos contractuales institucionales\nFalta de formación o actualización de los responsables de la contratación en la normatividad legal y reglamentaria que rige a la contratación de la Universidad.\nDebilidad o negligencia en el seguimiento y control del proceso de contratación\nDesignación de un funcionario que no cuenta con los conocimientos y/o experiencia requeridos para realizar el proceso de contratación\nOmisión o uso incorrecto y desarticulación de los sistemas de información que apoyan los trámites de contratación.\nEvitar las instancias de aprobación definidas en el Estatuto General de Contratación."]
["Falta de conocimiento por parte del interventor de la normativa y de los procedimientos aplicables.\nFalta de experiencia por parte del interventor en las actividades a su cargo.\nDebilidad en el proceso de selección del interventor.\nFalta o deficiencia de mecanismos que faciliten el seguimiento o interventoría del contrato.\nAusencia de capacitación al personal para asumir actividades de interventoría\nAlto manejo de la información en forma manual\nFalta de implementación de herramientas ofimáticas o tecnológicas.\nExcesiva carga laboral de los interventores.\n\n\n"]
["Falta de conocimiento por parte del servidor de las características del producto o servicio requerido\nFalta de conocimiento por parte del servidor de la normativa Universitaria o normas externas\nInexistencia o debilidad en la segregación de funciones durante el proceso de contratación\nFalta de planeación del proceso de contratación\nInadecuada realización del estudio de mercado\nAlto manejo de la información en forma manual\nDebilidad en el manejo de las herramientas ofimáticas o dispuestas por la Universidad.\nFalta de conocimiento o concentración por parte del servidor de los aspectos técnicos del estudio previo\n\n"]
["Falta de conocimiento por parte del servidor de la normativa Universitaria o normas externas\nInexistencia o debilidad en la segregación de funciones durante el proceso de contratación\nAlto manejo de la información en forma manual\nDebilidad en el manejo de las herramientas ofimáticas o dispuestas por la Universidad.\nFalta de conocimiento o concentración por parte del servidor de los aspectos técnicos de los términos de referencia o invitación a cotizar. "]
{"$rows_left_out":110}
{"sheet":"Listas","index":2,"n_rows":43,"n_cols":13,"rows_kept":43,"cut":false,"hidden":true,"merged":[[17,0,17,3]]}
["Clase","Fuente ","Etapa","Tipo de Contrato","Tipo Riesgo","Responsable Riesgo","Periodicidad","Cómo se realiza el monitoreo","Consecuencias","Probabilidad","Impacto","Dimensión","Tipos contrato prestación servicios"]
["General","Interno","Precontractual","Compraventa","Operacionales","Universidad","Permanente ","Estudio de documentos","Disminución de la calidad del servicio","Muy alta","Catastrófico","Económica","Mantenimiento"]
["Específico","Externo","Contractual","De obra ","Financieros (Crédito, Liquidez y Mercado)","Contratista","En hito(s) de la contratación","Análisis de cifras","Reprocesos","Alta","Severo","Cumplimiento","CIS"]
[null,null,"Poscontractual","Hospedaje","Corrupción","Aseguradora","Por evento","Análisis de progresos","Suspensión de actividades y/o servicios","Media","Moderado",null,"Ejecución personal"]
[null,null,null,"Mandato","Seguridad y Salud en el Trabajo","Universidad/Contratista","Semanal","Análisis de cantidades","Insatisfacción del usuario","Baja","Leve",null,"Adquisición licencias"]
[null,null,null,"Prestación de servicios",null,"Contratista/Aseguradora","Quincenal","Análisis de precios","Pérdida de Reputación","Muy baja","Insignificante",null,"Software"]
[null,null,null,"Prestación de servicios de Salud",null,"Universidad/Contratista/Asegurado","Mensual","Reunión con contratista e interventoría","Pérdida de credibilidad en los procesos",null,null,null,"Suscripción"]
[null,null,null,"Seguros",null,null,"Bimensual","Informes de avance","Pérdida de información",null,null,null,"Consultoría"]
[null,null,null,"Suministros AMP (Acuerdo Marco de Precios)",null,null,"Trimestral",null,"Procesos disciplinarios, penales, fiscales o administrativos sancionatorios",null,null,null,"Otros servicios de TI"]
[null,null,null,"Transporte",null,null,"Semestral",null,"Demandas "]
{"$rows_left_out":34}
{"sheet":"Matriz Riesgos","index":3,"n_rows":127,"n_cols":14,"rows_kept":127,"cut":false,"hidden":false,"merged":[[47,1,54,1],[39,1,46,1],[31,1,38,1],[23,1,30,1],[15,1,22,1],[7,1,14,1],[119,1,126,1],[111,1,118,1],[103,1,110,1],[95,1,102,1],[87,1,94,1],[79,1,86,1],[71,1,78,1],[63,1,70,1],[55,1,62,1],[0,0,0,13],[5,0,5,6],[5,8,5,11],[7,11,14,11],[7,8,14,8],[1,2,1,13],[4,1,4,13],[2,7,2,9],[7,4,14,4],[3,1,3,2],[5,12,6,12],[5,13,6,13],[3,12,3,13],[2,12,2,13],[2,10,2,11],[2,1,2,2],[3,10,3,11],[2,3,2,5],[3,3,3,7],[15,11,22,11],[7,6,14,6],[7,10,14,10],[7,9,14,9],[7,2,14,2],[7,5,14,5],[15,2,22,2],[15,5,22,5],[15,6,22,6],[15,8,22,8],[15,10,22,10],[15,9,22,9],[15,4,22,4],[7,3,14,3],[15,3,22,3],[23,11,30,11],[31,2,38,2],[31,5,38,5],[31,6,38,6],[31,8,38,8],[31,10,38,10],[31,9,38,9],[31,11,38,11],[23,5,30,5],[23,6,30,6],[23,8,30,8],[23,10,30,10],[23,9,30,9],[23,2,30,2],[23,4,30,4],[31,4,38,4],[23,3,30,3],[31,3,38,3],[39,11,46,11],[47,2,54,2],[47,5,54,5],[47,6,54,6],[47,8,54,8],[47,10,54,10],[47,9,54,9],[47,11,54,11],[39,5,46,5],[39,6,46,6],[39,8,46,8],[39,10,46,10],[39,9,46,9],[39,2,46,2],[39,4,46,4],[47,4,54,4],[39,3,46,3],[47,3,54,3],[55,11,62,11],[63,2,70,2],[63,5,70,5],[63,6,70,6],[63,8,70,8],[63,10,70,10],[63,9,70,9],[63,11,70,11],[55,5,62,5],[55,6,62,6],[55,8,62,8],[55,10,62,10],[55,9,62,9],[55,2,62,2],[55,4,62,4],[63,4,70,4],[55,3,62,3],[63,3,70,3],[71,11,78,11],[79,2,86,2],[79,5,86,5],[79,6,86,6],[79,8,86,8],[79,10,86,10],[79,9,86,9],[79,11,86,11],[71,5,78,5],[71,6,78,6],[71,8,78,8],[71,10,78,10],[71,9,78,9],[71,2,78,2],[71,4,78,4],[79,4,86,4],[71,3,78,3],[79,3,86,3],[87,11,94,11],[95,2,102,2],[95,5,102,5],[95,6,102,6],[95,8,102,8],[95,10,102,10],[95,9,102,9],[95,11,102,11],[87,5,94,5],[87,6,94,6],[87,8,94,8],[87,10,94,10],[87,9,94,9],[87,2,94,2],[87,4,94,4],[95,4,102,4],[87,3,94,3],[95,3,102,3],[103,11,110,11],[111,2,118,2],[111,5,118,5],[111,6,118,6],[111,8,118,8],[111,10,118,10],[111,9,118,9],[111,11,118,11],[103,5,110,5],[103,6,110,6],[103,8,110,8],[103,10,110,10],[103,9,110,9],[103,2,110,2],[103,4,110,4],[111,4,118,4],[103,3,110,3],[111,3,118,3],[119,11,126,11],[119,5,126,5],[119,6,126,6],[119,8,126,8],[119,10,126,10],[119,9,126,9],[119,2,126,2],[119,4,126,4],[119,3,126,3]]}
["MATRIZ DE RIESGOS PARA CONTRATOS (Estudio Previo de necesidad y conveniencia para contratar Numeral 14: Identificación, análisis calificación, asignación del riesgo y formas de mitigarlo y prevenirlo)"]
[]
[null,"Identificador interno: ",null,null,null,null,"Tipo de contrato:","Compraventa",null,null,"Subtipo contrato:",null,"Adquisición licencias"]
[null,"Objeto:",null,"Suministro, instalación, configuración y puesta en funcionamiento de los elementos requeridos para actualizar las controladoras y la plataforma de autenticación de la red inalámbrica (componentes centrales de la WLAN) de la Universidad de Antioquia, conforme a la cantidad, especificaciones y requerimientos establecidos en los términos de referencia y sus anexos",null,null,null,null,"Fecha:","2024-10-30","Diligenció: ",null,"Luz Adriana Gutiérrez\nJorge Barberi\nJaime Portocarrero"]
[]
["IDENTIFICACIÓN \n(Según el tipo de contrato consultar y seleccionar los riesgos a analizar en la catálogo de riesgos entregado)",null,null,null,null,null,null,"TRATAMIENTO\n(Elegir los tratamientos de la lista desplegable, si requieres incluir uno nuevo puedes hacerlo)","VALORACIÓN DEL RIESGO\n(Elegir de la lista desplegable, según los criterios de calificación)",null,null,null,"RESPONSABLE por implementar el tratamiento\n(Elegir de la lista desplegable)","Periodicidad de monitoreo al tratamiento\n(Elegir de la lista desplegable)"]
["Nro","Tipo de contrato","Descripción detallada \n(Qué puede pasar) Descripción (Posibilidad+ Acción + Sujeto/Objeto + Complemento)","Tipo de Riesgo","Etapa","Causas \n(Qué o quien lo puede generar y por qué se puede presentar)","Consecuencias","Tratamiento/Controles a ser implementados","Probabilidad","Dimensión del impacto","Impacto","Zona Riesgo"]
[1,"Compraventa","Posibilidad de incumplimiento de las obligaciones contractuales por alguna de las partes",{"$f":"IFERROR(VLOOKUP(C8,Banco!$E$2:$I$119,5,0),\"\")","v":"Operacionales"},{"$f":"IFERROR(VLOOKUP(C8,Banco!$E$2:$H$119,4,0),\"\")","v":"Contractual"},{"$f":"+IFERROR(VLOOKUP(C8,Banco!$E$1:$G$119,2,0),\"\")","v":"No pago oportuno de las facturas presentadas por el contratista\nIncumplimiento en los tiempos, forma y lugar de entrega pactados\nCambios de las especificaciones técnicas sin previo acuerdo con el competente del contrato\nFallas en la logística del contratista para la entrega del producto o prestación del servicio\nFalta de insumos requeridos para producción de los bienes y la prestación de los servicios.\nDemoras en los trámites de importación del producto\nInexistencia de inventario del producto en el momento en que es requerido \nProblemas a nivel social que impidan el tránsito libre de la mercancía o del personal que presta el servicio. \nSuspensión o cancelación de las autorizaciones expedidas por las autoridades competentes. \nCambios en la normativa de importación o exportación del producto o insumo requerido.\nPresencia de epidemias, pandemias o sindemas en el entorno \nUso indebido del anticipo \nIncumplimiento de los acuerdos de confidencialidad definidos en el contrato o con ocasión del contrato\n\n\n\n\n\n\n\n"},{"$f":"+IFERROR(VLOOKUP(C8,Banco!$E$1:$G$119,3,0),\"\")","v":"Suspensión o afectación de actividades y/o servicios\nInsatisfacción del usuario\nPérdidas económicas\nReprocesos\nProcesos disciplinarios, penales, fiscales o administrativos sancionatorios\nDemandas\nDetrimento Patrimonial\nDisminución de la calidad del servicio\n"},"Transferir/ Constituir póliza de cumplimiento de salarios, prestaciones sociales e indemnizaciones laborales","Baja","Cumplimiento","Moderado",{"$f":"IFERROR(VLOOKUP(CONCATENATE(I8,K8),Listas!$A$19:$D$43,4,FALSE),\"\")","v":"Moderada"},"Contratista/Aseguradora","Permanente "]
[1,null,null,null,null,null,null,"Reducir el riesgo/Seguimiento de la interventoría delegada por Universidad",null,null,null,null,"Universidad","Permanente "]
[1,null,null,null,null,null,null,"Reducir/ establecer requisitos técnicos mínimos del bien o servicio a contratar",null,null,null,null,"Universidad","Por evento"]
{"$rows_left_out":118}
{"sheet":"Mapa de Calor","index":4,"n_rows":19,"n_cols":8,"rows_kept":19,"cut":false,"hidden":false,"merged":[[11,2,11,5],[9,3,9,7],[0,0,0,7],[2,0,6,0]]}
["MATRIZ DE EVALUACIÓN DE RIESGOS (MAPA DE CALOR)"]
[]
["PROBABILIDAD",5,"Muy Alta"]
[null,4,"Alta",null,null,"R1 - "]
[null,3,"Media"]
[null,2,"Baja",null,null,null,"R2 - R3 - "]
[null,1,"Muy Baja"]
[null,null,null,"Insignificante","Leve","Moderado","Severo","Catastrófico"]
[null,null,null,1,5,10,15,20]
[null,null,null,"IMPACTO"]
{"$rows_left_out":9}