{"text_format":"1","workbook":"xlsx","n_sheets":4,"sheets":["Plantilla","SAP","Hoja1","Bancos  y Departamentos"],"not_rendered":{"charts":0,"images":1,"macros":1,"external_links":1,"defined_names":179,"comments":1,"pivot_tables":0},"unopened":[],"bounds":{"document_bytes":16777216,"sheet_cells":100000,"rows_first":2000,"rows_last":500,"rows_between":2000,"halvings":0,"cell_chars":16384,"cell_head_chars":4096},"cells_cut":0,"cells_raw":0,"read":"whole","date_system":"1900"}

{"sheet":"Plantilla","index":0,"n_rows":56,"n_cols":22,"rows_kept":56,"cut":false,"hidden":false,"merged":[[54,1,54,21],[15,6,15,14],[16,6,16,14],[21,9,21,10],[21,13,21,14],[24,5,24,14],[25,5,25,14],[13,14,13,15],[13,10,13,11],[37,13,37,21],[36,7,36,12],[37,7,37,12],[37,1,37,5],[38,9,38,10],[38,13,38,14],[41,5,41,14],[42,5,42,14],[35,18,35,21],[35,16,35,17],[35,1,35,2],[35,3,35,7],[35,11,35,15],[38,1,38,8],[33,1,34,2],[1,19,2,21],[1,1,4,1],[12,6,12,21],[12,3,12,5],[12,1,12,2],[13,1,13,4],[9,1,11,4],[9,5,11,7],[8,19,8,21],[11,8,11,21],[9,8,9,11],[9,12,9,15],[9,16,9,18],[9,19,9,21],[10,8,10,21],[6,1,6,21],[1,3,2,18],[3,3,4,18],[8,8,8,11],[8,12,8,15],[5,1,5,21],[8,16,8,18],[7,8,7,21],[7,1,8,4],[53,1,53,21],[16,15,16,21],[15,1,15,5],[22,5,22,21],[23,5,23,21],[21,15,21,21],[20,1,20,21],[21,1,21,8],[19,1,19,21],[22,1,25,4],[24,15,24,21],[27,1,27,21],[25,15,25,21],[44,1,44,21],[36,1,36,5],[38,15,38,21],[30,1,30,21],[42,15,42,21],[39,5,39,21],[40,5,40,21],[41,15,41,21],[39,1,42,4],[36,13,36,21],[32,5,32,7],[7,5,8,7],[14,1,14,4],[18,1,18,5],[17,7,17,12],[18,7,18,12],[15,15,15,21],[16,1,16,5],[47,1,47,7],[48,1,48,7],[33,7,33,8],[34,7,34,8],[33,10,33,11],[33,14,33,15],[35,8,35,10],[26,1,26,21],[47,16,47,17],[48,16,48,17],[29,1,29,21],[43,1,43,21],[17,13,17,21],[18,13,18,21],[17,1,17,5],[32,8,32,11],[32,12,32,15],[31,16,31,17],[28,6,28,12],[28,13,28,15],[28,16,28,21],[31,1,31,4],[31,5,31,7],[31,8,31,11],[31,12,31,15],[31,18,31,21],[32,17,32,19],[28,1,28,5],[32,1,32,4],[33,3,33,5],[34,3,34,5],[50,1,50,7],[51,1,51,7],[45,16,45,21],[45,8,45,15],[46,8,46,9],[46,16,46,17],[46,18,46,19],[46,20,46,21],[46,13,46,15],[47,8,47,9],[48,8,48,9],[51,20,51,21],[47,18,47,19],[48,18,48,19],[49,18,49,19],[50,18,50,19],[51,18,51,19],[51,8,51,9],[49,1,49,7],[50,8,50,9],[47,20,47,21],[48,20,48,21],[49,20,49,21],[50,20,50,21],[51,13,51,15],[45,1,46,7],[49,16,49,17],[50,16,50,17],[51,16,51,17],[47,13,47,15],[48,13,48,15],[49,13,49,15],[50,13,50,15],[49,8,49,9],[46,10,46,12],[47,10,47,12],[48,10,48,12],[49,10,49,12],[50,10,50,12],[51,10,51,12]]}
[]
[null,null,null,"INSCRIPCIÓN Y ACTUALIZACIÓN DE TERCEROS (DEUDORES Y ACREEDORES NACIONALES O DEL EXTERIOR)",null,null,null,null,null,null,null,null,null,null,null,null,null,null,null,"FECHA DE REGISTRO DE LA INFORMACIÓN"]
[]
[null,null,null,"GESTIÓN DEL FINANCIAMIENTO",null,null,null,null,null,null,null,null,null,null,null,null,null,null,null,"DÍA","MES","AÑO"]
[null,null,null,null,null,null,null,null,null,null,null,null,null,null,null,null,null,null,null,28,5,2019]
[]
[null,"INFORMACIÓN GENERAL (Aplica a personas naturales y jurídicas)"]
[null,"TIPO DE TERCERO",null,null,null,"CLASE DE TERCERO",null,null,"PERSONA NATURAL"]
{"$rows_left_out":49}
{"sheet":"SAP","index":1,"n_rows":28,"n_cols":3,"rows_kept":28,"cut":false,"hidden":false,"merged":[[0,0,0,2]]}
["DATOS"]
["CLASE",{"$f":"IF(Plantilla!B15=\"\",\"\",IF(Plantilla!B10=\"ACREEDOR\",VLOOKUP(Plantilla!F10,COD_GRUPOCUENTAAC,2,0),VLOOKUP(Plantilla!F10,COD_GRUPOCUENTADE,2,0)))","v":""},{"$f":"IF(Plantilla!S32=\"\",\"\",\"K002\")","v":""}]
["NOMBRE 1",{"$f":"TRIM(IFERROR(IF(AND(Plantilla!I10=\"\",Plantilla!Q10=\"\"),LEFT(UPPER(Plantilla!I12&\" \"),MATCH(40,IF(MID(UPPER(Plantilla!I12&\" \"),ROW(2:100),1)=\" \",ROW(2:100),\"\"))+1),UPPER(CONCATENATE(IF(Plantilla!Q10=\"\",\"\",Plantilla!Q10&\" \"),IF(Plantilla!T10=\"\",\"\",Plantilla!T10&\" \"),IF(Plantilla!I10=\"\",\"\",Plantilla!I10&\" \"),IF(Plantilla!M10=\"\",\"\",Plantilla!M10&\" \")))),\"\"))","v":""},{"$f":"TRIM(UPPER(Plantilla!I33&\" \"&Plantilla!M33&\" \"&Plantilla!B33&\" \"&Plantilla!F33))","v":""}]
["NOMBRE 2",{"$f":"IF(LEN(Plantilla!I12)<40,\"\",IFERROR(LEFT(SUBSTITUTE(UPPER(Plantilla!I12&\" \"),(B3)&\" \",\"\"),MATCH(40,IF(MID(SUBSTITUTE(UPPER(Plantilla!I12&\" \"),(B3)&\" \",\"\"),ROW(2:100),1)=\" \",ROW(2:100),\"\"))+1),\"\"))","v":""}]
["# DOC",{"$f":"UPPER(SUBSTITUTE(SUBSTITUTE(SUBSTITUTE(SUBSTITUTE(SUBSTITUTE(Plantilla!B15,\".\",\"\"),\" \",\"\"),\",\",\"\"),\"'\",\"\"),\"-\",\"\"))","v":""},{"$f":"SUBSTITUTE(SUBSTITUTE(SUBSTITUTE(SUBSTITUTE(SUBSTITUTE(Plantilla!R33,\".\",\"\"),\" \",\"\"),\",\",\"\"),\"'\",\"\"),\"-\",\"\")","v":""}]
["1ER NOM Y APEL",{"$f":"TRIM(UPPER(IF(AND(Plantilla!Q10=\"\",Plantilla!I10=\"\"),Plantilla!I12,Plantilla!Q10&\" \"&Plantilla!I10)))","v":""},{"$f":"TRIM(UPPER(Plantilla!I33&\" \"&Plantilla!B33))","v":""}]
["DIRECCIÓN",{"$f":"TRIM(UPPER(IF(AND(Plantilla!G15=\"\",Plantilla!H15=\"\"),CONCATENATE(IF(Plantilla!I15=\"\",\"\",SUBSTITUTE(Plantilla!I15,CHAR(10),\" \")),IFERROR(VLOOKUP(Plantilla!J15,COD_CUADRANTE,2,0),\" \"),IF(Plantilla!L15=\"\",\"\",Plantilla!L15&\" \"),IF(Plantilla!M15=\"\",\"\",Plantilla!M15&\" \"),IFERROR(VLOOKUP(Plantilla!N15,COD_CUADRANTE,2,0),\"\"),IF(Plantilla!P15=\"\",\"\",Plantilla!P15&\" \"),IFERROR(VLOOKUP(Plantilla!Q15,COD_NOMENCLATURA,2,0),\"\"),IF(Plantilla!R15=\"\",\"\",Plantilla!R15&\" \"),IFERROR(VLOOKUP(Plantilla!S15,COD_NOMENCLATURA,2,0),\"\"),IF(Plantilla!T35=\"\",\"\",Plantilla!T35&\" \"),IFERROR(VLOOKUP(Plantilla!U15,COD_NOMENCLATURA,2,0),\"\"),IF(Plantilla!V35=\"\",\"\",Plantilla!V35&\" \")),CONCATENATE(IFERROR(VLOOKUP(Plantilla!G15,COD_NOMENCLATURA,2,0),\"\"),IF(Plantilla!H15=\"\",\"\",Plantilla!H15&\" \"),IF(Plantilla!I15=\"\",\"\",Plantilla!I15&\" \"),IFERROR(VLOOKUP(Plantilla!J15,COD_CUADRANTE,2,0),\"\"),IF(Plantilla!L15=\"\",\"\",Plantilla!L15&\" \"),IF(Plantilla!M15=\"\",\"\",Plantilla!M15&\" \"),IFERROR(VLOOKUP(Plantilla!N15,COD_CUADRANTE,2,0),\"\"),IF(Plantilla!P15=\"\",\"\",Plantilla!P15&\" \"),IFERROR(VLOOKUP(Plantilla!Q15,COD_NOMENCLATURA,2,0),\"\"),IF(Plantilla!R15=\"\",\"\",Plantilla!R15&\" \"),IFERROR(VLOOKUP(Plantilla!S15,COD_NOMENCLATURA,2,0),\"\"),IF(Plantilla!T15=\"\",\"\",Plantilla!T15&\" \"),IFERROR(VLOOKUP(Plantilla!U15,COD_NOMENCLATURA,2,0),\"\"),IF(Plantilla!V15=\"\",\"\",Plantilla!V15&\" \")))))","v":""},{"$f":"TRIM(UPPER(IF(AND(Plantilla!D35=\"\",Plantilla!G35=\"\"),CONCATENATE(IF(Plantilla!H35=\"\",\"\",Plantilla!H35&\" \"),IFERROR(VLOOKUP(Plantilla!J35,COD_CUADRANTE,2,0),\"\"),IF(Plantilla!L35=\"\",\"\",Plantilla!L35&\" \"),IF(Plantilla!M35=\"\",\"\",Plantilla!M35&\" \"),IFERROR(VLOOKUP(Plantilla!N35,COD_CUADRANTE,2,0),\"\"),IF(Plantilla!P35=\"\",\"\",Plantilla!P35&\" \"),IFERROR(VLOOKUP(Plantilla!Q35,COD_NOMENCLATURA,2,0),\"\"),IF(Plantilla!R35=\"\",\"\",Plantilla!R35&\" \"),IFERROR(VLOOKUP(Plantilla!S35,COD_NOMENCLATURA,2,0),\"\"),IF(Plantilla!T35=\"\",\"\",Plantilla!T35&\" \"),IFERROR(VLOOKUP(Plantilla!U35,COD_NOMENCLATURA,2,0),\"\"),IF(Plantilla!V35=\"\",\"\",Plantilla!V35&\" \")),CONCATENATE(IFERROR(VLOOKUP(Plantilla!D35,COD_NOMENCLATURA,2,0),\"\"),IF(Plantilla!G35=\"\",\"\",Plantilla!G35&\" \"),IF(Plantilla!H35=\"\",\"\",Plantilla!H35&\" \"),IFERROR(VLOOKUP(Plantilla!J35,COD_CUADRANTE,2,0),\"\"),IF(Plantilla!L35=\"\",\"\",Plantilla!L35&\" \"),IF(Plantilla!M35=\"\",\"\",Plantilla!M35&\" \"),IFERROR(VLOOKUP(Plantilla!N35,COD_CUADRANTE,2,0),\"\"),IF(Plantilla!P35=\"\",\"\",Plantilla!P35&\" \"),IFERROR(VLOOKUP(Plantilla!Q35,COD_NOMENCLATURA,2,0),\"\"),IF(Plantilla!R35=\"\",\"\",Plantilla!R35&\" \"),IFERROR(VLOOKUP(Plantilla!S35,COD_NOMENCLATURA,2,0),\"\"),IF(Plantilla!T35=\"\",\"\",Plantilla!T35&\" \"),IFERROR(VLOOKUP(Plantilla!U35,COD_NOMENCLATURA,2,0),\"\"),IF(Plantilla!V35=\"\",\"\",Plantilla!V35&\" \")))))","v":""}]
["MUNICIPIO",{"$f":"UPPER(Plantilla!P17)","v":""},{"$f":"UPPER(Plantilla!S36)","v":""}]
{"$rows_left_out":21}
{"sheet":"Hoja1","index":2,"n_rows":3,"n_cols":36,"rows_kept":3,"cut":false,"hidden":true,"merged":[]}
[null,"TIPO DE TERCERO","TRATO","1ER NOMBRE O\nRAZÓN SOCIAL (Empresa)","2DO NOMBRE","1ER APELLIDOS","2DO APELLIDOS","TIPO DOCUMENTO","# IDENTIFICACION","DV RUT","A ECON","Tipo de vía","Nom/# vía","Letras/\nPrefijo","CUADRANTE","NÚMERO","Letras/\nPrefijo","CUADRANTE","NÚMERO","ELEMENTO","NOMBRE","ELEMENTO","NOMBRE","ELEMENTO","NOMBRE","PAIS","DEPARTAMENTO","MUNICIPIO","TEL FIJO","EXT","CELULAR","E_MAIL","MONEDA ","BANCO","NUMEROCUENTA","CLASECUENTA"]
[null,{"$f":"IF(Plantilla!F10=\"\",\"\",Plantilla!F10)","v":"Personas naturales"},null,{"$f":"IF(AND(Plantilla!I10=\"\",Plantilla!Q10=\"\"),Plantilla!I12,Plantilla!I10)","v":0},{"$f":"IF(Plantilla!M10=\"\",\"\",Plantilla!M10)","v":""},{"$f":"IF(Plantilla!Q10=\"\",\"\",Plantilla!Q10)","v":""},{"$f":"IF(Plantilla!T10=\"\",\"\",Plantilla!T10)","v":""},{"$f":"IF(Plantilla!D13=\"\",\"\",Plantilla!D13)","v":"Cédula ciudadanía"},{"$f":"IF(Plantilla!B15=\"\",\"\",Plantilla!B15)","v":""},{"$f":"IF(Plantilla!F15=\"\",\"\",Plantilla!F15)","v":""},{"$f":"IF(NOT(ISBLANK(Plantilla!J22)),CONCATENATE(Plantilla!J22,Plantilla!L22,Plantilla!M22,Plantilla!N22),\"\")","v":""},{"$f":"IF(Plantilla!G15=\"\",\"\",Plantilla!G15)","v":""},{"$f":"IF(Plantilla!H15=\"\",\"\",Plantilla!H15)","v":""},{"$f":"IF(Plantilla!I15=\"\",\"\",Plantilla!I15)","v":""},{"$f":"IF(Plantilla!J15=\"\",\"\",Plantilla!J15)","v":""},{"$f":"IF(Plantilla!L15=\"\",\"\",Plantilla!L15)","v":""},{"$f":"IF(Plantilla!M15=\"\",\"\",Plantilla!M15)","v":""},{"$f":"IF(Plantilla!N15=\"\",\"\",Plantilla!N15)","v":""},{"$f":"IF(Plantilla!P15=\"\",\"\",Plantilla!P15)","v":""},{"$f":"IF(Plantilla!Q15=\"\",\"\",Plantilla!Q15)","v":""},{"$f":"IF(Plantilla!R15=\"\",\"\",Plantilla!R15)","v":""},{"$f":"IF(Plantilla!S15=\"\",\"\",Plantilla!S15)","v":""},{"$f":"IF(Plantilla!R15=\"\",\"\",Plantilla!R15)","v":""},{"$f":"IF(Plantilla!U15=\"\",\"\",Plantilla!U15)","v":""},{"$f":"IF(Plantilla!V15=\"\",\"\",Plantilla!V15)","v":""},{"$f":"IF(Plantilla!B17=\"\",\"\",Plantilla!B17)","v":""},{"$f":"IF(Plantilla!G17=\"\",\"\",Plantilla!G17)","v":""},{"$f":"IF(Plantilla!P17=\"\",\"\",Plantilla!P17)","v":""},{"$f":"IF(Plantilla!B19=\"\",\"\",Plantilla!B19)","v":""},{"$f":"IF(Plantilla!G19=\"\",\"\",Plantilla!G19)","v":""},{"$f":"IF(Plantilla!H19=\"\",\"\",Plantilla!H19)","v":""},{"$f":"IF(Plantilla!N19=\"\",\"\",Plantilla!N19)","v":""},{"$f":"IF(Plantilla!G29=\"\",\"\",Plantilla!G29)","v":""},{"$f":"IF(Plantilla!F24=\"\",\"\",Plantilla!F24)","v":""},{"$f":"IF(Plantilla!F26=\"\",\"\",Plantilla!F26)","v":""},{"$f":"IF(Plantilla!P26=\"\",\"\",Plantilla!P26)","v":""}]
[null,{"$f":"IF(AND(Plantilla!F10<>\"\",Plantilla!R33<>\"\",Plantilla!S32<>\"\"),Plantilla!F10,\"\")","v":""},{"$f":"IF(Plantilla!F11=\"\",\"\",Plantilla!F11)","v":""},{"$f":"IF(Plantilla!B33=\"\",\"\",Plantilla!B33)","v":""},{"$f":"IF(Plantilla!F33=\"\",\"\",Plantilla!F33)","v":""},{"$f":"IF(Plantilla!I33=\"\",\"\",Plantilla!I33)","v":""},{"$f":"IF(Plantilla!M33=\"\",\"\",Plantilla!M33)","v":""},{"$f":"IF(Plantilla!S32=\"\",\"\",Plantilla!S32)","v":""},{"$f":"IF(Plantilla!R33=\"\",\"\",Plantilla!R33)","v":""},{"$f":"IF(Plantilla!V33=\"\",\"\",Plantilla!V33)","v":""},{"$f":"IF(NOT(ISBLANK(Plantilla!J39)),CONCATENATE(Plantilla!J39,Plantilla!L39,Plantilla!M39,Plantilla!N39),\"\")","v":""},{"$f":"IF(Plantilla!D35=\"\",\"\",Plantilla!D35)","v":""},{"$f":"IF(Plantilla!G35=\"\",\"\",Plantilla!G35)","v":""},{"$f":"IF(Plantilla!H35=\"\",\"\",Plantilla!H35)","v":""},{"$f":"IF(Plantilla!J35=\"\",\"\",Plantilla!J35)","v":""},{"$f":"IF(Plantilla!L35=\"\",\"\",Plantilla!L35)","v":""},{"$f":"IF(Plantilla!M35=\"\",\"\",Plantilla!M35)","v":""},{"$f":"IF(Plantilla!N35=\"\",\"\",Plantilla!N35)","v":""},{"$f":"IF(Plantilla!P35=\"\",\"\",Plantilla!P35)","v":""},{"$f":"IF(Plantilla!Q35=\"\",\"\",Plantilla!Q35)","v":""},{"$f":"IF(Plantilla!R35=\"\",\"\",Plantilla!R35)","v":""},{"$f":"IF(Plantilla!S35=\"\",\"\",Plantilla!S35)","v":""},{"$f":"IF(Plantilla!T35=\"\",\"\",Plantilla!T35)","v":""},{"$f":"IF(Plantilla!U35=\"\",\"\",Plantilla!U35)","v":""},{"$f":"IF(Plantilla!V35=\"\",\"\",Plantilla!V35)","v":""},{"$f":"IF(Plantilla!D36=\"\",\"\",Plantilla!D36)","v":""},{"$f":"IF(Plantilla!L36=\"\",\"\",Plantilla!L36)","v":""},{"$f":"IF(Plantilla!S36=\"\",\"\",Plantilla!S36)","v":""},{"$f":"IF(Plantilla!B38=\"\",\"\",Plantilla!B38)","v":""},{"$f":"IF(Plantilla!G38=\"\",\"\",Plantilla!G38)","v":""},{"$f":"IF(Plantilla!H38=\"\",\"\",Plantilla!H38)","v":""},{"$f":"IF(Plantilla!N38=\"\",\"\",Plantilla!N38)","v":""},{"$f":"IF(Plantilla!G30=\"\",\"\",Plantilla!G30)","v":""},{"$f":"IF(Plantilla!F41=\"\",\"\",Plantilla!F41)","v":""},{"$f":"IF(Plantilla!F43=\"\",\"\",Plantilla!F43)","v":""},{"$f":"IF(Plantilla!P43=\"\",\"\",Plantilla!P43)","v":""}]

{"sheet":"Bancos  y Departamentos","index":3,"n_rows":1485,"n_cols":164,"rows_kept":1485,"cut":false,"hidden":true,"merged":[]}
["BANCOS","COD",null,"PAISES","COD",null,"DEPARTAMENTOS","COD","PREFIJO","NOMBRE","Nomenclatura",null,"TIPOSAP","COD",null,"GRUPOCUENTA","COD","COD",null,"COD","TRATO",null,"CLASEIMPUESTO","COD",null,"CLASECUENTA","COD",null,"GRUPOTESORERIA","MONEDA","ADP","05","08",11,13,15,17,18,19,20,23,25,27,41,44,47,50,52,54,63,66,68,70,73,76,81,85,86,88,91,94,95,97,99,null,null,"CO","COD","AR","COD","DE","COD","AU","COD","AT","COD","BE","COD","BR","COD","BG","COD","CA","COD","CL","COD","CN","COD","KR","COD","HR","COD","DK","COD","SK","COD","SI","COD","ES","COD","US","COD","COD","RU","COD","PH","COD","FI","COD","FR","COD","GR","COD","HU","COD","IN","COD","IE","COD","IL","COD","IT","COD","JP","COD","KZ","COD","MX","COD","NO","COD","NZ","COD","NL","COD","PE","COD","PL","COD","PT","COD","GB","COD","CZ","COD","RO","COD","SG","COD","ZA","COD","SE","COD","CH","COD","TH","COD","TW","COD","TR","COD","UA","COD","VE"]
["BANCAMIA","59",null,"COLOMBIA","CO",null,"ANTIOQUIA","05",4,"AEROPUERTO","AER ",null,"Cédula ciudadanía",13,null,"Personas naturales","K002","K2",null,null,"SEÑOR",null,"Persona Jurídica","PJ",null,"CUENTA DE AHORROS","02",null,"Personas naturales","Peso colombiano","COP","ABEJORRAL","BARANOA","BOGOTA, D.C.","ACHI","ALMEIDA","AGUADAS","ALBANIA","ALMAGUER","AGUACHICA","AYAPEL","AGUA DE DIOS","ACANDI","ACEVEDO","ALBANIA","ALGARROBO","ACACIAS","ALBAN","ABREGO","ARMENIA","APIA","AGUADA","BUENAVISTA","ALPUJARRA","ALCALA","ARAUCA","AGUAZUL","COLON","PROVIDENCIA","EL ENCANTO","BARRANCO MINAS","CALAMAR","CARURU","LA PRIMAVERA",null,null,"ANTIOQUIA","05","BUENOS AIRES","01","BADEN-WURTEMBERG",8,"AUST CAPITAL TERR","ACT","BURGENLAND","B","AMBERES",1,"ACRE","AC","BURGAS",1,"ALBERTA","AB","I - IQUIQUE",1,"ANHUI",110,"BUSAN",12,"BJELOVARSKO-BILOGORS","G00","HOVEDSTADEN",1,"BRATISLAVA",1,"AJDOVSCINA",1,"ÁLAVA",1,"ALABAMA","AL",79,"ÁREA AUTONOM.JUDÍA",5,"BICOL",1,"AHVENANMAA",1,"AIN",1,"AITOLIA KAI AKARNAN",1,"BACS-KISKUN",26,"ANDAMAN Y NICO.IN.","CW","CARLOW",1,"CENTRAL","AG","AGRIGENTO",23,"AICHI",4,"AKMOLINSKAIA","AGS","AGUASCALIENTES",2,"AKERSHUS FYLKE","AKL","AUCKLAND",1,"DRENTHE",11,"AMAZONAS","DSL","DOLNOSLASKIE",42,"ALENTEJO CENTRAL","AB","ABERDEENSHIRE",31,"JIHOCESKY",1,"ALBA","SG","SINGAPUR","EC","EASTERN CAPE",1,"BLEKINGE LÄN","AG","ARGOVIA",1,"AMNAT CHAROEN","FJN","FU-CHIEN",1,"ADANA","CHR","CHERKAS'KA","AMA","AMAZONAS"]
["BANCO AGRARIO S.A.","40",null,"AFGANISTÁN","AF",null,"BOGOTÁ",11,1,"ALMACÉN","ALM ",null,"RUT- NIT",31,null,"Personas Jurídicas","K003","K3",null,null,"SEÑORA",null,"Persona Natural","PN",null,"CUENTA CORRIENTE","01",null,"Personas jurídicas","Dólar americano","USD","ABRIAQUI","BARRANQUILLA",null,"ALTOS DEL ROSARIO","AQUITANIA","ANSERMA","BELEN DE LOS ANDAQUIES","ARGELIA","AGUSTIN CODAZZI","BUENAVISTA","ALBAN","ALTO BAUDO","AGRADO","BARRANCAS","ARACATACA","BARRANCA DE UPIA","ALDANA","ARBOLEDAS","BUENAVISTA","BALBOA","ALBANIA","CAIMITO","ALVARADO","ANDALUCIA","ARAUQUITA","CHAMEZA","LEGUIZAMO","SAN ANDRES","LA CHORRERA","CACAHUAL","EL RETORNO","MITU","PUERTO CARREÑO",null,null,"BOGOTÁ","11","CAPITAL FEDERAL","00","BAJA SAJONIA",3,"AUSTRALIA MERIDIONAL","SA","CARINTIA","K","BRABANTE (FLAMENCO)",2,"ALAGOAS","AL","GRAD SOFIYA",2,"COLUMBIA BRITÁNICA","BC","II - ANTOFAGASTA",2,"BEIJING (PEKÍN)",10,"CHOLLABUK-DO",2,"DUBROVACKO-NERETVANS","T00","MIDTJYLLAND",2,"STREDOSLOVENSKY",3,"BREZICE",2,"ALBACETE",2,"ALASKA","AK",28,"ÁREA DE AMUR",2,"CAGAYAN VALLEY",2,"ETELÄ-SUOMI",2,"AISNE",2,"AKHAIA",2,"BARANYA",1,"ANDRA PRADESH","CN","CAVAN",2,"HAIFA","AL","ALESSANDRIA",5,"AKITA",5,"AKTUBINSKAIA","BC","BAJA CALIFORNIA",9,"AUST-AGDER FYLKE","BOP","BAY OF PLENTY",2,"FLEVOLAND",5,"ANCASH","K-P","KUJAWSKO-POMORSKIE",40,"ALENTEJO LITORAL","AL","ANGLESEY",64,"JIHOMORAVSKY",2,"ARAD",null,null,"FS","FREE STATE",2,"DALARNAS LÄN","AR","AUSSER-RHODEN",2,"ANG THONG","KSH","KAO-HSIUNG",2,"ADIYAMAN","CHG","CHERNIGIVS'KA","ANZ","ANZOATEGUI"]
["BANCO AV VILLAS","52",null,"ALBANIA","AL",null,"AMAZONAS",91,8,"ALTILLO","AL ",null,"Cédula extranjería",22,null,"Extranjeros","K004","K4",null,null,"SEÑORES",null,null,null,null,null,null,null,"Extranjeros","Euro europeo","EUR","ALEJANDRIA","CAMPO DE LA CRUZ",null,"ARENAL","ARCABUCO","ARANZAZU","CARTAGENA DEL CHAIRA","BALBOA","ASTREA","CANALETE","ANAPOIMA","BAGADO","AIPE","DISTRACCION","ARIGUANI","CABUYARO","ANCUYA","BOCHALEMA","CALARCA","BELEN DE UMBRIA","ARATOCA","CHALAN","AMBALEMA","ANSERMANUEVO","CRAVO NORTE","HATO COROZAL","MOCOA",null,"LA PEDRERA","INIRIDA","MIRAFLORES","PACOA","SAN JOSE DE OCUNE",null,null,"AMAZONAS","91","CATAMARCA",2,"BAVIERA",9,"AUTRALIA OCCIDENTAL","WA","BAJA AUSTRIA","NOE","HAINAUT",3,"AMAZONAS","AM","KHASKOVO",3,"MANITOBA","MB","III - COPIAPO",3,"CHONG QING",320,"CHOLLANAM-DO",3,"ISTARSKA","S00","NORDJYLLAND",3,"VYCHODOSLOVENSKY",4,"CELJE",3,"ALICANTE",3,"ARIZONA","AZ",29,"ÁREA DE ARKHANGELSK",3,"CENTRAL LUZON",3,"ITÄ-SUOMI",3,"ALLIER",3,"ARGOLIS",3,"BEKES",2,"ARUNACHAL PRADESH","CE","CLARE",3,"JERUSALÉN","AN","ANCONA",2,"AOMORI","00","ALMATYNSKAIA","BCS","BAJA CALIFORNIA S",6,"BUSKERUD FYLKE","CAN","CANTERBURY",3,"FRISIA",19,"APURIMAC","LDZ","LÓDZKIE",50,"ALGARVE","AN","ANGUS/FORFANSHIRE",41,"KARLOVARSKY",3,"ARGES",null,null,"LP","LIMPOPO",4,"GÄVLEBORGS LÄN","BS","BASILEA CIUDAD",3,"BURIRAM","TPE","T´AI-PEI",3,"AFYON","CHV","CHERNOVITS'KA","APU","APURE"]
["BANCO BOGOTÁ","01",null,"ALEMANIA","DE",null,"ARAUCA",81,7,"ANILLO VIAL","AVIAL ",null,"TAX ID -Doc extranjeros PJ ",44,null,"Entes públicos","K005","K5",null,null,"SEÑOR Y SEÑORA",null,null,null,null,null,null,null,"Entes públicos","(Int.) Dólares americanos (5 decimales)","USDN","AMAGA","CANDELARIA",null,"ARJONA","BELEN","BELALCAZAR","CURILLO","BOLIVAR","BECERRIL","CERETE","ANOLAIMA","BAHIA SOLANO","ALGECIRAS","EL MOLINO","CERRO SAN ANTONIO","CASTILLA LA NUEVA","ARBOLEDA","BUCARASICA","CIRCASIA","DOSQUEBRADAS","BARBOSA","COLOSO","ANZOATEGUI","ARGELIA","FORTUL","LA SALINA","ORITO",null,"LETICIA","LA GUADALUPE","SAN JOSE DEL GUAVIARE","PAPUNAHUA","SANTA RITA",null,null,"ARAUCA","81","CHACO",16,"BERLÍN",11,"NUEVA GALES DEL SUR","NSW","ALTA AUSTRIA","OOE","LIEJA",4,"AMAPÁ","AP","LOVECH",4,"NEW BRUNSWICK","NB","IV - LA SERENA",4,"FUJIAN",150,"CH'UNGCH'ONGBUK-DO",4,"KARLOVACKA ","D00","SJAELLAND",4,"ZAPADOSLOVENSKY",2,"CERKNICA",4,"ALMERÍA",4,"ARKANSAS","AR",30,"ÁREA DE ASTRACÁN",11,"CNTRL MINDANAO",4,"LAPPI",4,"ALPES (ALTA PROVENZ)",4,"ARKADHIA",4,"BEKESCSABA",3,"ASSAM","C","CORK",4,"NORTHERN","AO","AOSTA",12,"CHIBA",6,"ATYRAUSKAIA","CMP","CAMPECHE",20,"FINNMARK FYLKE","HAB","HAWKE´S BAY",4,"GELDERLAND",8,"AREQUIPA","LBL","LUBELSKIE",41,"ALTO ALENTEJO","AT","ANTRIM",52,"KRALOVEHRADECKY",4,"BACAU",null,null,"NC","NORTHERN CAPE",3,"GOTLANDS LÄN","BL","BASILEA PROVINCIA",4,"CHACHOENGSAO","TWN","TAIWÁN",4,"AGRI","DNP","DNIPROPETROVS'KA","ARA","ARAGUA"]
["BANCO CAJA SOCIAL - BCSC S.A.","32",null,"ANDORRA","AD",null,"ATLÁNTICO","08",5,"APARTAMENTO","AP ",null,"Doc identif Extranjero",42,null,"Empleados","K006","K6",null,null,null,null,null,null,null,null,null,null,"Empleados","(Interno) marco alemán (3 decimales)","DEM3","AMALFI","GALAPA",null,"BARRANCO DE LOBA","BERBEO","CHINCHINA","EL DONCELLO","BUENOS AIRES","BOSCONIA","CHIMA","ARBELAEZ","BAJO BAUDO","ALTAMIRA","FONSECA","CHIBOLO","CUBARRAL","BARBACOAS","CACHIRA","CORDOBA","GUATICA","BARICHARA","COROZAL","ARMERO","BOLIVAR","PUERTO RONDON","MANI","PUERTO ASIS",null,"MIRITI-PARANA","MORICHAL",null,"TARAIRA","SANTA ROSALIA",null,null,"ATLÁNTICO","08","CHUBUT",17,"BRANDENBURGO",12,"QUEENSLAND","QLD","SALZBURGO","S","LIMBURGO",5,"BAHÍA","BA","MONTANA",5,"TERRANOVA/LABRADOR","NL","V - VALPARAISO",5,"GANSU",260,"CH'UNGCH'ONGNAM-DO",5,"KOPRIVNICKO-KRIZEVAC","F00","SYDDANMARK",5,null,null,"CRNOMELJ",5,"ASTURIAS",33,"CALIFORNIA","CA",31,"ÁREA DE BELGOROD",7,"CNTRL VISAYAS",5,"LÄNSI-SUOMI",5,"ALPES (ALTOS)",5,"ARTA",5,"BORSOD-ABAUJ-ZEMPLEN",25,"BENGALA OESTE","DL","DONEGAL",5,"SOUTHERN","AR","AREZZO",38,"EHIME",11,"GAMBILSKAIA","CHS","CHIAPAS",4,"HEDMARK FYLKE","MAN","MANAWATU-WANGANUI",5,"GRONINGEN",18,"AYACUCHO","LBS","LUBUSKIE",17,"ALTO TRÁS-OS-MONTES","AG","ARGYLLSHIRE",51,"LIBERECKY",5,"BIHOR",null,null,"NW","NORTH WEST",5,"HALLANDS LÄN","BE","BERNA",5,"CHAI NAT",null,null,68,"AKSARAY","DON","DONETS'KA","BAR","BARINAS"]
["BANCO CORPBANCA COLOMBIA S.A.","06",null,"ANGOLA","AO",null,"BOLÍVAR",13,5,"AUTOPISTA","AUT ",null,"Pasaporte",41,null,null,null,null,null,null,null,null,null,null,null,null,null,null,null,"Afgani","AFN","ANDES","JUAN DE ACOSTA",null,"CALAMAR","BETEITIVA","FILADELFIA","EL PAUJIL","CAJIBIO","CHIMICHAGUA","CHINU","BELTRAN","BOJAYA","BARAYA","HATONUEVO","CIENAGA","CUMARAL","BELEN","CACOTA","FILANDIA","LA CELIA","BARRANCABERMEJA","COVEÑAS","ATACO","BUENAVENTURA","SARAVENA","MONTERREY","PUERTO CAICEDO",null,"PUERTO NARIÑO","PANA PANA",null,"YAVARATE",null,null,null,"BOLÍVAR","13","CÓRDOBA",3,"BREMEN",4,"TASMANIA","TAS","ESTIRIA","ST","LUXEMBURGO",6,"CEARÁ","CE","PLOVDIV",6,"NUEVA ESCOCIA","NS","VI - RANCAGUA",6,"GUANGDONG",190,"DAEGU",14,"KRAPINSKO-ZAGORSKA","B00",null,null,null,null,"DRAVOGRAD",6,"ÁVILA",5,"CAROLINA DEL NORTE","NC",32,"ÁREA DE BRYANSK",8,"EAST VISAYAS",6,"OULU",6,"ALPES MARÍTIMOS",6,"ATTIKI",6,"BUDAPEST",4,"BIHAR","D","DUBLÍN",6,"TEL AVIV","AP","ASCOLI PICENO",18,"FUKUI",9,"KARAGANDINSKAIA","CHI","CHIHUAHUA",12,"HORDALAND FYLKE","NTL","NORTHLAND",6,"LIMBURGO",12,"CAJAMARCA","MAL","MALOPOLSKIE",12,"AVE","AM","ARMAGH",81,"MORAVSKOSLEZSKY",6,"BISTRITA-NASAUD",null,null,"WC","WESTERN CAPE",6,"JÄMTLANDS LÄN","GR","CANTÓN DE GRISONES",6,"CHAIYAPHUM",null,null,5,"AMASYA","HAR","HARKIVS'KA","BOL","BOLÍVAR"]
["BANCO DAVIVIENDA S.A.","51",null,"ANGUILLA","AI",null,"BOYACA",15,8,"AVENIDA","AV ",null,"Reg. civil de nacimiento",11,null,null,null,null,null,null,null,null,null,null,null,null,null,null,null,"Afgani (ant.)","AFA","ANGELOPOLIS","LURUACO",null,"CANTAGALLO","BOAVITA","LA DORADA","FLORENCIA","CALDONO","CHIRIGUANA","CIENAGA DE ORO","BITUIMA","CARMEN DEL DARIEN","CAMPOALEGRE","MAICAO","CONCORDIA","EL CALVARIO","BUESACO","CHINACOTA","GENOVA","LA VIRGINIA","BETULIA","GALERAS","CAJAMARCA","BUGALAGRANDE","TAME","NUNCHIA","PUERTO GUZMAN",null,"PUERTO SANTANDER","PUERTO COLOMBIA",null,null,null,null,null,"BOYACA","15","CORRIENTES",4,"EL SARRE",10,"TERRITORIO DEL NORTE","NT","TIROL","T","NAMUR",7,"BRASÍLIA","DF","RUSE",7,"TERRITORIO NORESTE","NT","VII - TALCA",7,"GUANGXI",210,"DAEJEON",15,"LICKO-SENJSKA ","I00",null,null,null,null,"GORNJA RADGONA",7,"BADAJOZ",6,"CAROLINA DEL SUR","SC",74,"ÁREA DE CHELÍABINSK",1,"ILOCOS",null,null,7,"ARDÈCHE",7,"DHODHEKANISOS",7,"CSONGRAD",27,"CHANDIGARH","G","GALWAY",null,null,"AT","ASTI",40,"FUKUOKA",1,"KOSTANAISKAIA","COA","COAHUILA",15,"MØRE OG ROMSDAL F.","OTA","OTAGO",7,"NOORD-BRABANT",20,"CUZCO","MAZ","MAZOWIECKIE",43,"BAIXO ALENTEJO","AY","AYRSHIRE",71,"OLOMOUCKY",7,"BOTOSANI",null,null,"ZN","KWAZULU-NATAL",7,"JÖNKÖPINGS LÄN","FR","FRIBURGO",7,"CHANTHABURI",null,null,6,"ANKARA","HRS","HERSONS'KA","CAR","CARABOBO"]
{"$rows_left_out":1477}